{"text_format":"2","workbook":"xlsx","n_sheets":5,"sheets":["765송부","345송부","154송부","한수원","서부발전"],"not_rendered":{"charts":0,"images":0,"macros":0,"external_links":1,"defined_names":15,"comments":0,"pivot_tables":0},"unopened":[],"bounds":{"document_bytes":16777216,"sheet_cells":100000,"run_cost":"one","rows_first":2000,"rows_last":500,"rows_between":2000,"halvings":0,"cell_chars":16384,"cell_head_chars":4096},"cells_cut":0,"cells_raw":0,"read":"whole","date_system":"1900"}

{"sheet":"765송부","index":0,"n_rows":13,"n_cols":16,"rows_kept":13,"cut":false,"hidden":false,"merged":[[2,5,3,5],[2,0,3,0],[2,1,3,1],[2,2,3,2],[2,3,3,3],[2,4,3,4],[2,14,3,14],[2,15,3,15],[2,6,2,7],[2,8,2,9],[2,10,3,10],[2,11,3,11],[2,12,3,12],[2,13,3,13]]}
["2015년도 10월 휴전계획서"]
["765kV"]
["번호","1차사업소","사업소","설비명","공사명","공사개요","신청일시",null,"조정일시",null,"작업구분","연간반영\n(Y/N)","처리결과\n(Y/N)","처리사유","Key-point","시송전설비\n 여부"]
[{"$nulls":6},"시작","종료","시작","종료"]
[1,"강원","태백","신태백S/S TIE-#4 M.Tr 1차 CB","765kV 신태백S/S 800kV GIS 증설공사","8571CB 및 DS 설치, 85BAY 단모선 GIS 철거(8500CB)","2015-10-05 09:00","2015-11-28 18:00","2015-10-05 09:00","2015-11-28 18:00","연속",null,null,null,201508190251]
[2,"강원","태백","신태백S/S 765kV #1 BUS","765kV 신태백S/S 800kV GIS 증설공사","- 800kV GIS * 3CB 설치 - 85BAY 단모선 GIS 철거","2015-10-05 09:00","2015-10-12 18:00","2015-10-05 09:00","2015-10-12 18:00","연속",null,null,null,201508100088]
[3,"대전충남","서산","당진T/P 765kV #1 BUS","15년 서산P/O 장기사용 배전반 교체","○ 765kV 모선보호반 교체 공사","2015-10-12 09:00","2015-10-16 18:00","2015-10-12 09:00","2015-10-16 18:00","연속",null,null,null,201508130111]
[4,"대전충남","서산","당진T/P 765kV #2 BUS","15년 서산P/O 장기사용 배전반 교체","○ 765kV 모선보호반 교체 공사","2015-10-19 09:00","2015-10-23 18:00","2015-10-19 09:00","2015-10-23 18:00","연속",null,null,null,201508130114]
[5,"부산울산","동부산","신고리S/S 북경남#2T/L-#4G T/L TIE CB","신고리S/S 800kV GIS 초기점검공사","신고리S/S 800kV 8300 GIS 초기점검(G4 휴전가능으로 8372GIS와 동시 휴전)","2015-10-19 09:00","2015-10-24 18:00","2015-10-19 09:00","2015-10-24 18:00","연속",null,null,null,201508130208]
[6,"부산울산","동부산","신고리S/S #3 M.Tr A-1","신고리S/S 765kV M.Tr 초기점검공사","1. 신고리S/S 765kV #3M.Tr 초기점검 2. 신고리S/S 800kV 8571,8500 GIS 초기점검 3. 고리N/P S/Y 362kV 7A00, 7A72 GIS 초기점검 4. 고리N/P S/Y 7A02,7A62 GIS 가스누기 보수 5. 고리N/P S/Y 7A72 GIS 유압불량 보수","2015-10-12 09:00","2015-10-17 18:00","2015-10-12 09:00","2015-10-17 18:00","연속",null,null,null,201508130202]
[7,"부산울산","동부산","신고리S/S #3M.Tr 1차 TIE CB","765kV 신고리S/S 81Bay 분리공사(8500CB 휴전)","- 8500CB 휴전(8572CB 설치관련) - 800kV 50kA 8,000A GIS*1CB 신설(8472CB) - 800kV 50kA 8,000A GIS*1CB 이설(8172CB→8572CB)","2015-10-05 09:00","2015-12-16 18:00","2015-10-05 09:00","2015-12-16 18:00","연속",null,null,null,201508040021]
[8,"부산울산","동부산","신고리S/S #1 M.Tr A-1","신고리S/S 765kV M.Tr 초기점검공사","1. 신고리S/S 765kV #1M.Tr 초기점검 2. 신고리S/S 800kV 8471,8400 GIS 초기점검 3. 고리N/P S/Y 362kV 7800, 7872 GIS 초기점검 4. 고리N/P S/Y 7872 GIS 유압불량 보수","2015-10-26 09:00","2015-10-31 18:00","2015-10-26 09:00","2015-10-31 18:00","연속",null,null,null,201508130205]
[9,"부산울산","동부산","신고리S/S #4GEN T/L CB","신고리S/S 800kV GIS 초기점검공사","신고리S/S 800kV 8372 GIS 초기점검(G4 휴전가능으로 8300GIS와 동시 휴전)","2015-10-19 09:00","2015-10-24 18:00","2015-10-19 09:00","2015-10-24 18:00","연속",null,null,null,201508130209]

{"sheet":"345송부","index":1,"n_rows":196,"n_cols":16,"rows_kept":196,"cut":false,"hidden":false,"merged":[[2,5,3,5],[2,0,3,0],[2,1,3,1],[2,2,3,2],[2,3,3,3],[2,4,3,4],[2,14,3,14],[2,15,3,15],[2,6,2,7],[2,8,2,9],[2,10,3,10],[2,11,3,11],[2,12,3,12],[2,13,3,13]]}
[{"$f":"'765송부'!A1","v":"2015년도 10월 휴전계획서"}]
["345kV"]
["번호","1차사업소","사업소","설비명","공사명","공사개요","신청일시",null,"조정일시",null,"작업구분","연간반영\n(Y/N)","처리결과\n(Y/N)","처리사유","Key-point","시송전설비\n여부"]
[{"$nulls":6},"시작","종료","시작","종료"]
[1,"서울","성동","성동S/S #2 M.Tr A","성동S/S 345kV 주변압기 및 OLTC 정밀점검공사","주변압기 및 OLTC 정밀점검(#2MTR) x 1Bank","2015-10-12 08:00","2015-10-21 18:00","2015-10-12 08:00","2015-10-21 18:00","연속",null,null,null,201508170264,{"$f":"IF(ISERROR(VLOOKUP(D5,[1]시송전설비!$C$2:$O$130,13,0)),\"-\",VLOOKUP(D5,[1]시송전설비!$C$2:$O$130,13,0))","v":"-"}]
[2,"서울","성동","성동S/S 345kV #1 Sh.R","성동S/S 345kV Sh.R 제작사 발췌점검공사","Sh.R 차단기(7179) 내부 성능개선에 따른 제작사 발췌 내부점검","2015-10-15 09:00","2015-10-16 18:00","2015-10-15 09:00","2015-10-16 18:00","연속",null,null,null,201508210121,{"$f":"IF(ISERROR(VLOOKUP(D6,[1]시송전설비!$C$2:$O$130,13,0)),\"-\",VLOOKUP(D6,[1]시송전설비!$C$2:$O$130,13,0))","v":"-"}]
[3,"서울","성동","성동S/S #3 M.Tr A","성동S/S 345kV 주변압기 및 OLTC 정밀점검공사","주변압기 및 OLTC 정밀점검(#3MTR) x 1Bank","2015-10-01 08:00","2015-10-08 18:00","2015-10-01 08:00","2015-10-08 18:00","연속",null,null,null,201508170295,{"$f":"IF(ISERROR(VLOOKUP(D7,[1]시송전설비!$C$2:$O$130,13,0)),\"-\",VLOOKUP(D7,[1]시송전설비!$C$2:$O$130,13,0))","v":"-"}]
[4,"서울","중부","중부S/S 345kV #2 Sh.R","15년 중부전력지사 장기사용 배전반 대체공사","중부S/S #2Sh.R 배전반 대체공사","2015-10-12 10:00","2015-10-14 18:00","2015-10-12 10:00","2015-10-14 18:00","연속",null,null,null,201508210068,{"$f":"IF(ISERROR(VLOOKUP(D8,[1]시송전설비!$C$2:$O$130,13,0)),\"-\",VLOOKUP(D8,[1]시송전설비!$C$2:$O$130,13,0))","v":"-"}]
[5,"서울","중부","중부S/S #3 M.Tr A","15년 중부전력지사 345kV M.Tr 정밀점검 공사","중부S/S 345kV #3M.Tr 누유 보수","2015-10-29 10:00","2015-10-29 18:00","2015-10-29 10:00","2015-10-29 18:00","연속",null,null,null,201508100058,{"$f":"IF(ISERROR(VLOOKUP(D9,[1]시송전설비!$C$2:$O$130,13,0)),\"-\",VLOOKUP(D9,[1]시송전설비!$C$2:$O$130,13,0))","v":"-"}]
[6,"서울","중부","중부S/S 345kV #1 Sh.R","15년 중부전력지사 장기사용 배전반 대체공사","중부S/S #1Sh.R 배전반 대체공사","2015-10-05 10:00","2015-10-07 18:00","2015-10-05 10:00","2015-10-07 18:00","연속",null,null,null,201508100045,{"$f":"IF(ISERROR(VLOOKUP(D10,[1]시송전설비!$C$2:$O$130,13,0)),\"-\",VLOOKUP(D10,[1]시송전설비!$C$2:$O$130,13,0))","v":"-"}]
[7,"남서울","강남","신양재S/S 345kV #2 BUS","신양재S/S 모선보호반 대체 - 345kV #2BUS","신양재S/S 모선보호반 대체 - 345kV #2BUS - 7172, 7272, 7372, 7472 CB 및 DS 개방","2015-10-26 09:00","2015-10-30 18:00","2015-10-26 09:00","2015-10-30 18:00","연속",null,null,null,201507140015,{"$f":"IF(ISERROR(VLOOKUP(D11,[1]시송전설비!$C$2:$O$130,13,0)),\"-\",VLOOKUP(D11,[1]시송전설비!$C$2:$O$130,13,0))","v":"-"}]
[8,"남서울","강남","신양재S/S 345kV #1 BUS","신양재S/S 모선보호반 대체 - 345kV #1BUS","신양재S/S 모선보호반 대체 - 345kV #1BUS - 7171, 7271, 7300, 7471 CB 및 DS 개방","2015-10-19 09:00","2015-10-23 18:00","2015-10-19 09:00","2015-10-23 18:00","연속",null,null,null,201507140014,{"$f":"IF(ISERROR(VLOOKUP(D12,[1]시송전설비!$C$2:$O$130,13,0)),\"-\",VLOOKUP(D12,[1]시송전설비!$C$2:$O$130,13,0))","v":"-"}]
[9,"남서울","강남","신양재S/S #3 M.Tr A","신양재S/S #3M.Tr 보호배전반 대체","신양재S/S #3M.Tr 보호배전반 대체 - 병행작업 : #3M.TR 보통점검 (변전협력회사)","2015-10-12 09:00","2015-10-16 18:00","2015-11-23 09:00","2015-11-27 18:00","연속",null,null,null,201507140003,{"$f":"IF(ISERROR(VLOOKUP(D13,[1]시송전설비!$C$2:$O$130,13,0)),\"-\",VLOOKUP(D13,[1]시송전설비!$C$2:$O$130,13,0))","v":"-"}]
[10,"남서울","강남","신양재S/S #2 M.Tr A","신양재S/S #2M.Tr 보호배전반 대체","신양재S/S #2M.Tr 보호배전반 대체 - 병행작업 : #2M.Tr 보통점검 (변전협력회사)","2015-10-05 09:00","2015-10-09 18:00","2015-10-12 10:00","2015-10-16 18:00","연속",null,null,null,201507140002,{"$f":"IF(ISERROR(VLOOKUP(D14,[1]시송전설비!$C$2:$O$130,13,0)),\"-\",VLOOKUP(D14,[1]시송전설비!$C$2:$O$130,13,0))","v":"-"}]
[11,"남서울","동서울","동서울S/S #4 M.Tr A","동서울S/S 345KV #4M.TR 절연불량 붓싱교체","동서울S/S 345KV #4M.TR 절연불량 붓싱교체(C상:HO,XO)","2015-10-19 08:00","2015-10-20 18:00","2015-10-19 08:00","2015-10-20 18:00","연속",null,null,null,201508110218,{"$f":"IF(ISERROR(VLOOKUP(D15,[1]시송전설비!$C$2:$O$130,13,0)),\"-\",VLOOKUP(D15,[1]시송전설비!$C$2:$O$130,13,0))","v":"-"}]
[12,"남서울","동서울","동서울S/S #2 M.Tr A","동서울S/S 345KV #2M.TR 절연불량 붓싱교체","동서울S/S 345KV #2M.TR 절연불량 붓싱교체(B상:HO,XO)","2015-10-15 08:00","2015-10-16 18:00","2015-10-15 08:00","2015-10-16 18:00","연속",null,null,null,201508110217,{"$f":"IF(ISERROR(VLOOKUP(D16,[1]시송전설비!$C$2:$O$130,13,0)),\"-\",VLOOKUP(D16,[1]시송전설비!$C$2:$O$130,13,0))","v":"-"}]
[13,"남서울","동서울","동서울S/S #1 M.Tr A","동서울S/S 345KV #1M.TR 절연불량 붓싱교체","동서울S/S 345KV #1M.TR 절연불량 붓싱교체(A상:HO,XO, C상:H1)","2015-10-12 08:00","2015-10-14 18:00","2015-10-12 08:00","2015-10-14 18:00","연속",null,null,null,201508110212,{"$f":"IF(ISERROR(VLOOKUP(D17,[1]시송전설비!$C$2:$O$130,13,0)),\"-\",VLOOKUP(D17,[1]시송전설비!$C$2:$O$130,13,0))","v":"-"}]
[14,"남서울","영서","신시흥영서#2 T/L","신시흥-영서#2T/L 보호배전반 정기점검","신시흥-영서#2T/L 보호배전반 정기점검","2015-10-02 10:00","2015-10-02 18:00","2015-10-02 10:00","2015-10-02 18:00","당일",null,null,null,201508170219,{"$f":"IF(ISERROR(VLOOKUP(D18,[1]시송전설비!$C$2:$O$130,13,0)),\"-\",VLOOKUP(D18,[1]시송전설비!$C$2:$O$130,13,0))","v":"-"}]
[15,"남서울","영서","신시흥영서#1 T/L","362kV GCB 정밀점검","362kV GCB 정밀점검","2015-10-12 10:00","2015-10-16 18:00","2015-10-12 10:00","2015-10-16 18:00","연속",null,null,null,201508180047,{"$f":"IF(ISERROR(VLOOKUP(D19,[1]시송전설비!$C$2:$O$130,13,0)),\"-\",VLOOKUP(D19,[1]시송전설비!$C$2:$O$130,13,0))","v":"-"}]
[16,"남서울","영서","영서S/S 345kV 70-71 SEC CB (70-71-0)","362kV GCB 정밀점검","362kV GCB 정밀점검","2015-10-19 10:00","2015-10-23 18:00","2015-10-19 10:00","2015-10-23 18:00","연속",null,null,null,201508180043,{"$f":"IF(ISERROR(VLOOKUP(D20,[1]시송전설비!$C$2:$O$130,13,0)),\"-\",VLOOKUP(D20,[1]시송전설비!$C$2:$O$130,13,0))","v":"-"}]
[17,"남서울","영서","영서S/S 345kV 75-76 SEC CB (75-76-0)","362kV GCB 정밀점검","362kV GCB 정밀점검","2015-10-19 10:00","2015-10-23 18:00","2015-10-19 10:00","2015-10-23 18:00","연속",null,null,null,201508180045,{"$f":"IF(ISERROR(VLOOKUP(D21,[1]시송전설비!$C$2:$O$130,13,0)),\"-\",VLOOKUP(D21,[1]시송전설비!$C$2:$O$130,13,0))","v":"-"}]
[18,"남서울","직할","영등포S/S #2 M.Tr A","345kV #2M.Tr 보호배전반 정기점검","345kV #2M.Tr 보호배전반 정기점검","2015-10-09 14:00","2015-10-09 18:00","2015-10-09 14:00","2015-10-09 18:00","당일",null,null,"신뢰도개선",201508170155,{"$f":"IF(ISERROR(VLOOKUP(D22,[1]시송전설비!$C$2:$O$130,13,0)),\"-\",VLOOKUP(D22,[1]시송전설비!$C$2:$O$130,13,0))","v":"-"}]
[19,"남서울","직할","영등포S/S #3 M.Tr A","345kV #3M.Tr 보호배전반 정기점검","345kV #3M.Tr 보호배전반 정기점검","2015-10-10 10:00","2015-10-10 18:00","2015-10-10 10:00","2015-10-10 18:00","당일",null,null,"신뢰도개선",201508170161,{"$f":"IF(ISERROR(VLOOKUP(D23,[1]시송전설비!$C$2:$O$130,13,0)),\"-\",VLOOKUP(D23,[1]시송전설비!$C$2:$O$130,13,0))","v":"-"}]
[20,"남서울","직할","영등포S/S #1 M.Tr A","345kV #1M.Tr 보호배전반 정기점검","345kV #1M.Tr 보호배전반 정기점검","2015-10-09 09:00","2015-10-09 14:00","2015-10-09 09:00","2015-10-09 14:00","당일",null,null,"신뢰도개선",201508170154,{"$f":"IF(ISERROR(VLOOKUP(D24,[1]시송전설비!$C$2:$O$130,13,0)),\"-\",VLOOKUP(D24,[1]시송전설비!$C$2:$O$130,13,0))","v":"-"}]
[21,"인천","시흥","신시흥영흥TP#2 T/L","신시흥-영흥#2T/L 정밀점검","신시흥-영흥#2T/L 정밀점검","2015-10-09 09:00","2015-10-16 18:00","2015-10-21 08:00","2015-10-26 18:00","연속",null,null,"신뢰도개선",201508100169,{"$f":"IF(ISERROR(VLOOKUP(D25,[1]시송전설비!$C$2:$O$130,13,0)),\"-\",VLOOKUP(D25,[1]시송전설비!$C$2:$O$130,13,0))","v":"-"}]
[22,"인천","시흥","신시흥영흥TP#4 T/L","신시흥-영흥#4T/L 정밀점검","신시흥-영흥#4T/L 정밀점검","2015-10-01 09:00","2015-10-08 18:00","2015-10-15 08:00","2015-10-20 18:00","연속",null,null,"신뢰도개선",201508100168,{"$f":"IF(ISERROR(VLOOKUP(D26,[1]시송전설비!$C$2:$O$130,13,0)),\"-\",VLOOKUP(D26,[1]시송전설비!$C$2:$O$130,13,0))","v":"-"}]
[23,"인천","인천","서인천C/C 345kV #70 BUS","345kV 서(신)인천C/C 용량부족 GIS 대체공사","- #70BUS 모선 보호용 CT 케이블 분리 및 결선","2015-10-03 09:30","2015-10-03 17:30","2015-10-04 08:00","2015-10-04 13:00","당일",null,null,"신뢰도개선",201508040030,{"$f":"IF(ISERROR(VLOOKUP(D27,[1]시송전설비!$C$2:$O$130,13,0)),\"-\",VLOOKUP(D27,[1]시송전설비!$C$2:$O$130,13,0))","v":"-"}]
[24,"인천","인천","서인천C/C 345kV #75 BUS","345kV 서(신)인천C/C 용량부족 GIS 대체공사","- #75BUS 모선 보호용 CT 케이블 분리 및 결선","2015-10-04 09:30","2015-10-04 17:30","2015-10-04 13:00","2015-10-04 19:00","당일",null,null,"신뢰도개선",201508040032,{"$f":"IF(ISERROR(VLOOKUP(D28,[1]시송전설비!$C$2:$O$130,13,0)),\"-\",VLOOKUP(D28,[1]시송전설비!$C$2:$O$130,13,0))","v":"-"}]
[25,"인천","인천","서인천C/C 서인천CC신부평#3T/L #2Sh.R GIS","345kV 서(신)인천C/C 용량부족 GIS 대체공사","- 서인천C/C 74Bay(7471,7400) GIS 대체","2015-10-05 06:00","2015-11-05 17:30","2015-10-05 06:00","2015-11-05 17:30","연속",null,null,null,201508040034,{"$f":"IF(ISERROR(VLOOKUP(D29,[1]시송전설비!$C$2:$O$130,13,0)),\"-\",VLOOKUP(D29,[1]시송전설비!$C$2:$O$130,13,0))","v":"-"}]
[26,"인천","인천","서인천C/C 신부평#3T/L Sh.R(#2 Sh.R)","345kV 서(신)인천C/C 용량부족 GIS 대체공사","- #2Sh.R용 GIS 대체","2015-10-05 06:00","2015-11-05 17:30","2015-10-05 06:00","2015-11-05 17:30","연속",null,null,null,201508040042,{"$f":"IF(ISERROR(VLOOKUP(D30,[1]시송전설비!$C$2:$O$130,13,0)),\"-\",VLOOKUP(D30,[1]시송전설비!$C$2:$O$130,13,0))","v":"-"}]
{"$rows_left_out":167}
{"sheet":"154송부","index":2,"n_rows":315,"n_cols":16,"rows_kept":315,"cut":false,"hidden":false,"merged":[[2,5,3,5],[2,0,3,0],[2,1,3,1],[2,2,3,2],[2,3,3,3],[2,4,3,4],[2,14,3,14],[2,15,3,15],[2,6,2,7],[2,8,2,9],[2,10,3,10],[2,11,3,11],[2,12,3,12],[2,13,3,13]]}
[{"$f":"'765송부'!A1","v":"2015년도 10월 휴전계획서"}]
["154kV"]
["번호","1차사업소","사업소","설비명","공사명","공사개요","신청일시",null,"조정일시",null,"작업구분","연간반영\n(Y/N)","처리결과\n(Y/N)","처리사유","Key-point","시송전설비\n여부"]
[{"$nulls":6},"시작","종료","시작","종료"]
[1,"서울","성동","쌍문미아#2 T/L","미아S/S 170KV 장기사용 GIS 교체공사","170KV 장기사용 GIS 철거 및 신규 설치","2015-10-05 09:30","2015-11-02 17:00","2015-10-05 09:30","2015-11-02 17:00","연속",null,null,"신뢰도개선",201508150001,{"$f":"IF(ISERROR(VLOOKUP(D5,[1]시송전설비!$C$2:$O$130,13,0)),\"-\",VLOOKUP(D5,[1]시송전설비!$C$2:$O$130,13,0))","v":"-"}]
[2,"서울","성동","휘경종암#2 T/L","휘경S/S 170kV 장기사용 GIS 대체공사","휘경종암#2T/L GIS 대체","2015-10-24 09:00","2015-11-18 18:00","2015-10-24 09:00","2015-11-18 18:00","연속",null,null,"신뢰도개선",201508190164,{"$f":"IF(ISERROR(VLOOKUP(D6,[1]시송전설비!$C$2:$O$130,13,0)),\"-\",VLOOKUP(D6,[1]시송전설비!$C$2:$O$130,13,0))","v":"-"}]
[3,"서울","성동","성동휘경#1 T/L","휘경S/S 170kV 장기사용 GIS 대체공사","성동휘경#1T/L GIS 대체","2015-10-24 09:00","2015-11-18 18:00","2015-10-24 09:00","2015-11-18 18:00","연속",null,null,"신뢰도개선",201508190168,{"$f":"IF(ISERROR(VLOOKUP(D7,[1]시송전설비!$C$2:$O$130,13,0)),\"-\",VLOOKUP(D7,[1]시송전설비!$C$2:$O$130,13,0))","v":"-"}]
[4,"서울","중부","수색S/S 154kV #2 BUS","14~15년 중부P/O 변전협력회사 총액공사","#1M.Tr LS 보통점검","2015-10-03 14:00","2015-10-03 18:00","2015-10-03 14:00","2015-10-03 18:00","연속",null,null,null,201508100067,{"$f":"IF(ISERROR(VLOOKUP(D8,[1]시송전설비!$C$2:$O$130,13,0)),\"-\",VLOOKUP(D8,[1]시송전설비!$C$2:$O$130,13,0))","v":"-"}]
[5,"서울","중부","수색S/S 154kV #1 BUS","14~15년 중부P/O 변전협력회사 총액공사","#4M.Tr LS 보통점검","2015-10-17 08:00","2015-10-17 14:00","2015-10-17 08:00","2015-10-17 14:00","연속",null,null,null,201508100062,{"$f":"IF(ISERROR(VLOOKUP(D9,[1]시송전설비!$C$2:$O$130,13,0)),\"-\",VLOOKUP(D9,[1]시송전설비!$C$2:$O$130,13,0))","v":"-"}]
[6,"서울","중부","수색S/S 154kV #2 BUS","14~15년 중부P/O 변전협력회사 총액공사","#4M.Tr LS 보통점검","2015-10-17 14:00","2015-10-17 18:00","2015-10-17 14:00","2015-10-17 18:00","연속",null,null,null,201508100064,{"$f":"IF(ISERROR(VLOOKUP(D10,[1]시송전설비!$C$2:$O$130,13,0)),\"-\",VLOOKUP(D10,[1]시송전설비!$C$2:$O$130,13,0))","v":"-"}]
[7,"서울","중부","수색S/S 154kV #1 BUS","14~15년 중부P/O 변전협력회사 총액공사","#1M.Tr LS 보통점검","2015-10-03 08:00","2015-10-03 14:00","2015-10-03 08:00","2015-10-03 14:00","연속",null,null,null,201508100061,{"$f":"IF(ISERROR(VLOOKUP(D11,[1]시송전설비!$C$2:$O$130,13,0)),\"-\",VLOOKUP(D11,[1]시송전설비!$C$2:$O$130,13,0))","v":"-"}]
[8,"서울","중부","양주은평#1 T/L","154kV 양주-은평T/L 안전이격거리 확보공사","철탑 11m 상향 * 2기 전력선 교체(인상) 작업 *1.240 c-km","2015-10-12 09:00","2015-10-18 18:00","2015-10-12 09:00","2015-10-18 18:00","연속",null,null,null,201508170343,{"$f":"IF(ISERROR(VLOOKUP(D12,[1]시송전설비!$C$2:$O$130,13,0)),\"-\",VLOOKUP(D12,[1]시송전설비!$C$2:$O$130,13,0))","v":"-"}]
[9,"서울","중부","양주은평#2 T/L","154kV 양주-은평T/L 안전이격거리 확보공사","철탑 11m 상향 * 2기 전력선 교체(인상) 작업 *1.240 c-km","2015-10-05 09:00","2015-10-11 18:00","2015-10-05 09:00","2015-10-11 18:00","연속",null,null,null,201508170338,{"$f":"IF(ISERROR(VLOOKUP(D13,[1]시송전설비!$C$2:$O$130,13,0)),\"-\",VLOOKUP(D13,[1]시송전설비!$C$2:$O$130,13,0))","v":"-"}]
[10,"서울","직할","마포신촌 T/L","신촌S/S 154kV 장기사용 GIS 대체","마포신촌T/L GIS 대체","2015-10-04 08:00","2015-10-23 18:00","2015-10-04 08:00","2015-10-23 18:00","연속",null,null,null,201507090041,{"$f":"IF(ISERROR(VLOOKUP(D14,[1]시송전설비!$C$2:$O$130,13,0)),\"-\",VLOOKUP(D14,[1]시송전설비!$C$2:$O$130,13,0))","v":"-"}]
[11,"서울","직할","신촌순화 T/L","신촌S/S 154kV 장기사용 GIS 대체","신촌순화T/L GIS 교체","2015-10-25 08:00","2015-11-13 18:00","2015-10-25 08:00","2015-11-13 18:00","연속",null,null,null,201507090102,{"$f":"IF(ISERROR(VLOOKUP(D15,[1]시송전설비!$C$2:$O$130,13,0)),\"-\",VLOOKUP(D15,[1]시송전설비!$C$2:$O$130,13,0))","v":"-"}]
[12,"서울","직할","방산중앙#1 T/L","중앙S/S 170kV GIS 대체공사","중앙S/S 170kV GIS 대체공사(#2M.Tr 1차, 방산중앙#1T/L)","2015-10-24 09:30","2015-11-14 18:00","2015-10-24 09:30","2015-11-14 18:00","당일",null,null,null,201508190247,{"$f":"IF(ISERROR(VLOOKUP(D16,[1]시송전설비!$C$2:$O$130,13,0)),\"-\",VLOOKUP(D16,[1]시송전설비!$C$2:$O$130,13,0))","v":"-"}]
[13,"남서울","강남","신사논현#1 T/L","신사-논현#1T/L 보호배전반 정기점검","신사-논현#1T/L 보호배전반 정기점검","2015-10-12 10:00","2015-10-12 14:00","2015-10-12 10:00","2015-10-12 14:00","당일",null,null,null,201508170198,{"$f":"IF(ISERROR(VLOOKUP(D17,[1]시송전설비!$C$2:$O$130,13,0)),\"-\",VLOOKUP(D17,[1]시송전설비!$C$2:$O$130,13,0))","v":"-"}]
[14,"남서울","강남","신사논현#2 T/L","신사-논현#2T/L 보호배전반 정기점검","신사-논현#2T/L 보호배전반 정기점검","2015-10-12 14:00","2015-10-12 18:00","2015-10-12 14:00","2015-10-12 18:00","당일",null,null,null,201508170200,{"$f":"IF(ISERROR(VLOOKUP(D18,[1]시송전설비!$C$2:$O$130,13,0)),\"-\",VLOOKUP(D18,[1]시송전설비!$C$2:$O$130,13,0))","v":"-"}]
[15,"남서울","강남","신양재역삼#2 T/L","신양재-역삼#2T/L 보호배전반 정기점검","신양재-역삼#2T/L 보호배전반 정기점검","2015-10-13 12:00","2015-10-13 15:00","취소","취소","당일",null,null,null,201508170208,{"$f":"IF(ISERROR(VLOOKUP(D19,[1]시송전설비!$C$2:$O$130,13,0)),\"-\",VLOOKUP(D19,[1]시송전설비!$C$2:$O$130,13,0))","v":"-"}]
[16,"남서울","강남","신양재역삼#1 T/L","신양재-역삼#1T/L 보호배전반 정기점검","신양재-역삼#1T/L 보호배전반 정기점검","2015-10-13 09:00","2015-10-13 12:00","취소","취소","당일",null,null,null,201508170207,{"$f":"IF(ISERROR(VLOOKUP(D20,[1]시송전설비!$C$2:$O$130,13,0)),\"-\",VLOOKUP(D20,[1]시송전설비!$C$2:$O$130,13,0))","v":"-"}]
[17,"남서울","강남","신양재역삼#3 T/L","신양재-역삼#3T/L 보호배전반 정기점검","신양재-역삼#3T/L 보호배전반 정기점검","2015-10-13 15:00","2015-10-13 18:00","취소","취소","당일",null,null,null,201508170209,{"$f":"IF(ISERROR(VLOOKUP(D21,[1]시송전설비!$C$2:$O$130,13,0)),\"-\",VLOOKUP(D21,[1]시송전설비!$C$2:$O$130,13,0))","v":"-"}]
[18,"남서울","강남","신양재신사#3 T/L","신양재-신사#3T/L 구형 절연통보호장치 교체공사","신양재-신사#3T/L 구형 절연통보호장치 교체공사","2015-10-05 10:00","2015-10-07 14:00","2015-10-05 10:00","2015-10-07 14:00","연속",null,null,null,201508130107,{"$f":"IF(ISERROR(VLOOKUP(D22,[1]시송전설비!$C$2:$O$130,13,0)),\"-\",VLOOKUP(D22,[1]시송전설비!$C$2:$O$130,13,0))","v":"-"}]
[19,"남서울","동서울","동서울송파#2 T/L","동서울-송파#2T/L 보호배전반 정기점검","동서울-송파#2T/L 보호배전반 정기점검","2015-10-19 10:00","2015-10-19 13:30","2015-10-19 10:00","2015-10-19 13:30","당일",null,null,null,201508170195,{"$f":"IF(ISERROR(VLOOKUP(D23,[1]시송전설비!$C$2:$O$130,13,0)),\"-\",VLOOKUP(D23,[1]시송전설비!$C$2:$O$130,13,0))","v":"-"}]
[20,"남서울","동서울","천호구의#1 T/L","154kV 천호-구의T/L 천호대교 횡간구간 교체공사","ㅇ 공사목적 : 노후 OF케이블 교체로 절연유 누유 및 고장 예방 ㅇ 공사개요 - 구간 : 154kV 천호-구의T/L J/B#5~J/B#8(1-1) - 선종 및 길이 : 154㎸ XLPE 2,000㎟ × 2회선, 1.174㎞ - 케이블 접속 : 보통접속2개소","2015-10-01 10:00","2015-12-30 17:00","2015-10-01 10:00","2015-12-30 17:00","연속",null,null,null,201508170212,{"$f":"IF(ISERROR(VLOOKUP(D24,[1]시송전설비!$C$2:$O$130,13,0)),\"-\",VLOOKUP(D24,[1]시송전설비!$C$2:$O$130,13,0))","v":"-"}]
[21,"남서울","동서울","천호구의#2 T/L","천호-구의#2T/L 보호배전반 정기점검","천호-구의#2T/L 보호배전반 정기점검","2015-10-19 14:00","2015-10-19 18:00","2015-10-19 14:00","2015-10-19 18:00","당일",null,null,null,201508170196,{"$f":"IF(ISERROR(VLOOKUP(D25,[1]시송전설비!$C$2:$O$130,13,0)),\"-\",VLOOKUP(D25,[1]시송전설비!$C$2:$O$130,13,0))","v":"-"}]
[22,"남서울","영서","가양등촌#1 T/L","가양S/S 장기사용 170kV GIS 대체공사","170kV GIS 5CCT 대체","2015-10-12 09:00","2015-11-16 18:00","2015-10-12 09:00","2015-11-16 18:00","연속",null,null,null,201507210026,{"$f":"IF(ISERROR(VLOOKUP(D26,[1]시송전설비!$C$2:$O$130,13,0)),\"-\",VLOOKUP(D26,[1]시송전설비!$C$2:$O$130,13,0))","v":"-"}]
[23,"남서울","영서","광명구공#2 T/L","170kV GIS 정밀점검공사(광명S/S 광명-구공#2T/L)","170kV GIS 정밀점검공사(광명S/S 광명-구공#2T/L)","2015-10-16 09:00","2015-10-18 18:00","2015-10-26 09:00","2015-10-28 18:00","연속",null,null,null,201508190137,{"$f":"IF(ISERROR(VLOOKUP(D27,[1]시송전설비!$C$2:$O$130,13,0)),\"-\",VLOOKUP(D27,[1]시송전설비!$C$2:$O$130,13,0))","v":"-"}]
[24,"남서울","영서","독산S/S 154kV #2 BUS","170kV GIS 정밀점검공사(독산S/S 대림-독산T/L)","170kV GIS 정밀점검공사(독산S/S 대림-독산T/L)","2015-10-05 09:00","2015-10-06 14:00","취소","취소","연속",null,null,null,201508190099,{"$f":"IF(ISERROR(VLOOKUP(D28,[1]시송전설비!$C$2:$O$130,13,0)),\"-\",VLOOKUP(D28,[1]시송전설비!$C$2:$O$130,13,0))","v":"-"}]
[25,"남서울","영서","독산S/S 154kV #1 BUS","170kV GIS 정밀점검공사(독산S/S 대림-독산T/L)","170kV GIS 정밀점검공사(독산S/S 대림-독산T/L)","2015-10-06 14:00","2015-10-08 18:00","취소","취소","연속",null,null,null,201508190101,{"$f":"IF(ISERROR(VLOOKUP(D29,[1]시송전설비!$C$2:$O$130,13,0)),\"-\",VLOOKUP(D29,[1]시송전설비!$C$2:$O$130,13,0))","v":"-"}]
[26,"남서울","영서","독산대방#1 T/L","170kV GIS 정밀점검공사(독산S/S 독산-대방#1T/L)","170kV GIS 정밀점검공사(독산S/S 독산-대방#1T/L)","2015-10-12 09:00","2015-10-13 18:00","2015-10-19 09:00","2015-10-21 18:00","연속",null,null,null,201508190121,{"$f":"IF(ISERROR(VLOOKUP(D30,[1]시송전설비!$C$2:$O$130,13,0)),\"-\",VLOOKUP(D30,[1]시송전설비!$C$2:$O$130,13,0))","v":"-"}]
{"$rows_left_out":286}
{"sheet":"한수원","index":3,"n_rows":18,"n_cols":20,"rows_kept":18,"cut":false,"hidden":false,"merged":[[15,17,16,17],[15,18,16,18],[15,19,16,19],[15,11,16,11],[15,12,16,12],[15,13,16,13],[15,14,16,14],[15,15,16,15],[15,16,16,16],[7,19,8,19],[15,0,16,0],[15,1,16,1],[15,2,16,2],[15,3,16,3],[15,4,16,4],[15,5,16,5],[15,6,15,7],[15,8,15,9],[15,10,16,10],[7,13,8,13],[7,14,8,14],[7,15,8,15],[7,16,8,16],[7,17,8,17],[7,18,8,18],[2,18,3,18],[7,5,8,5],[7,6,7,7],[7,8,7,9],[7,10,8,10],[7,11,8,11],[2,19,3,19],[7,0,8,0],[7,1,8,1],[7,2,8,2],[7,3,8,3],[7,4,8,4],[2,8,2,9],[2,10,3,10],[2,11,3,11],[2,12,3,12],[2,13,3,13],[2,14,3,14],[7,12,8,12],[2,15,3,15],[2,16,3,16],[2,17,3,17],[0,0,0,6],[2,0,3,0],[2,1,3,1],[2,2,3,2],[2,3,3,3],[2,4,3,4],[2,5,3,5],[2,6,2,7]]}
["2015년 10월 월간휴전계획표(한수원)"]
["765kV"]
["번호","1차사업소","사업소","설비명","공사명","공사개요","신청일시",null,"조정일시",null,"작업구분","연간\n(Y/N)","처리결과\n(Y/N)","처리사유","Key-point","북상\n선로","수도권\n환상망","발전\n연계","사업소간","사업소내"]
[{"$nulls":6},"시작","종료","시작","종료"]
[1,"고리본부","신고리2발","#4 주변압기","4호기 주변압기 및 소내보조변압기 가동전시험 수행                            *조작차단기 : PCB 8300, 8372","○ 4호기 주변압기 및 소내보조변압기 가동전시험 수행","2015-10-26 09:00","2015-11-06 18:00","2015-10-26 09:00","2015-11-06 18:00","연속","N"]
[]
["345kV"]
["번호","1차사업소","사업소","설비명","공사명","공사개요","신청일시",null,"조정일시",null,"작업\n구분","연간\n(Y/N)","처리결과\n(Y/N)","처리사유","Key-point","북상\n선로","수도권\n환상망","발전\n연계","사업소간","사업소내"]
[{"$nulls":6},"시작","종료","시작","종료"]
[1,"고리본부","신고리2발","#4 대기보조변압기","4호기 대기보조변압기 가동전시험/154kV SWYD - 4호기 MCR 연동시험\n*조작차단기 : PCB 6500, 6572","○ 대기보조변압기(TR02M/N) 보호신호 확인 시험\n○ 154kV SWYD - 4호기 MCR 연동 시험","2015-10-05 09:00","2015-10-23 18:00","2015-10-05 09:00","2015-10-23 18:00","연속","N"]
[2,"월성본부","1발전소","#2 주변압기","월성 2호기  제15차 계획예방정비관련 주변압기/소내용변압기 점검\n* 조작차단기 : CB7300,7372","- 주변압기/소내용변압기 일반점검\n- 주발전기, 주/소내보조변압기 보호계전기 \n   정기시험(차단기 연동시험 포함)","2015-10-01 09:00","2015-10-11 18:00","2015-10-01 09:00","2015-10-11 18:00","연속","N"]
[3,"월성본부","1발전소","#2 기동용변압기","월성 2호기 제15차 계획예방정비관련 기동용변압기 점검\n*조작차단기 : CB7400, CB7472","- 기동용변압기 일반점검\n- 기동용변압기 보호계전기 정기시험\n   (차단기 연동시험 포함)","2015-10-15 09:00","2015-10-22 18:00","2015-10-15 09:00","2015-10-22 18:00","연속","N",null,null," "]
[4,"한울본부","한울3발","#6 주변압기","6호기 8차 계획예방정비 \n* 조작차단기 : PCB 7C00, 7C72","○ 스위치야드 'C Bay' 교체공사\n○ 갑종보호반(GEN/MTR/UAT) 디지털 삼중화\n○ 주변압기 C상 교체 및 소내보조변압기 정밀점검","2015-10-13T16:00:00","2015-11-20T18:00:00","2015-10-13T16:00:00","2015-11-20T18:00:00","연속","Y"]
[]
["154kV"]
["번호","1차사업소","사업소","설비명","공사명","공사개요","신청일시",null,"조정일시",null,"작업구분","연간\n(Y/N)","처리결과\n(Y/N)","처리사유","Key-point","북상\n선로","수도권\n환상망","발전\n연계","사업소간","사업소내"]
[{"$nulls":6},"시작","종료","시작","종료"]
[1,"고리본부","신고리2발","#4 대기보조변압기","4호기 대기보조변압기 가동전시험/154kV SWYD - 4호기 MCR 연동시험\n*조작차단기 : PCB 6500, 6572","○ 대기보조변압기(TR02M/N) 보호신호 확인 시험\n○ 154kV SWYD - 4호기 MCR 연동 시험","2015-10-05 09:00","2015-10-23 18:00","2015-10-05 09:00","2015-10-23 18:00","연속","N"]

{"sheet":"서부발전","index":4,"n_rows":6,"n_cols":15,"rows_kept":6,"cut":false,"hidden":false,"merged":[[3,14,4,14],[3,6,3,7],[3,8,3,9],[3,10,4,10],[3,11,4,11],[3,12,4,12],[3,13,4,13],[3,5,4,5],[3,0,4,0],[3,1,4,1],[3,2,4,2],[3,3,4,3],[3,4,4,4]]}
["회사명 : 한국서부발전"]
["2015년도 10월 휴전계획서"]
["154kV"]
["번호","1차사업소","사업소","설비명","공사명","공사개요","신청일시",null,"조정일시",null,"작업구분","연간반영\n(Y/N)","처리결과\n(Y/N)","처리사유","Key-point"]
[{"$nulls":6},"시작","종료","시작","종료"]
[1,"서인천발전본부","-","제8호기 승압변압기","제8호기 간이정비\n* 조작차단기 : 6833","- 제8호기 간이예방정비공사 및 법정검사 수검","2015-10-10 09:00","2015-10-16 16:00","2015-10-10 09:00","2015-10-16 16:00","연속",null,null,null," "]