{"text_format":"2","workbook":"xlsx","n_sheets":4,"sheets":["765송부","345송부","154송부","한수원"],"not_rendered":{"charts":0,"images":0,"macros":0,"external_links":1,"defined_names":10,"comments":0,"pivot_tables":0},"unopened":[],"bounds":{"document_bytes":16777216,"sheet_cells":100000,"run_cost":"one","rows_first":2000,"rows_last":500,"rows_between":2000,"halvings":0,"cell_chars":16384,"cell_head_chars":4096},"cells_cut":0,"cells_raw":0,"read":"whole","date_system":"1900"}

{"sheet":"765송부","index":0,"n_rows":5,"n_cols":16,"rows_kept":5,"cut":false,"hidden":false,"merged":[[2,14,3,14],[2,15,3,15],[2,6,2,7],[2,8,2,9],[2,10,3,10],[2,11,3,11],[2,12,3,12],[2,13,3,13],[2,5,3,5],[2,0,3,0],[2,1,3,1],[2,2,3,2],[2,3,3,3],[2,4,3,4]]}
["2015년도 8월 휴전계획서"]
["765kV"]
["번호","1차사업소","사업소","설비명","공사명","공사개요","신청일시",null,"조정일시",null,"작업구분","연간반영\n(Y/N)","처리결과\n(Y/N)","처리사유","Key-point","시송전설비\n 여부"]
[{"$nulls":6},"시작","종료","시작","종료"]
[1,"부산울산","동부산","신고리S/S 765kV #2 BUS","765kV 신고리S/S #2M.Tr 이설공사","○ 작업내용 - 주모선 연결(765kV 85Bay #2BUS ~ 86Bay #2BUS) - LA 이설(85Bay측 #2BUS에서 86Bay측 #2BUS로 이설) - 준공시험 및 무부하시험가압 등","2015-08-05 09:00","2015-08-20 10:00","2015-08-05 09:00","2015-08-20 10:00","연속",null,null,null,201506050219]

{"sheet":"345송부","index":1,"n_rows":31,"n_cols":16,"rows_kept":31,"cut":false,"hidden":false,"merged":[[2,14,3,14],[2,15,3,15],[2,6,2,7],[2,8,2,9],[2,10,3,10],[2,11,3,11],[2,12,3,12],[2,13,3,13],[2,5,3,5],[2,0,3,0],[2,1,3,1],[2,2,3,2],[2,3,3,3],[2,4,3,4]]}
["2015년도 8월 휴전계획서"]
["345kV"]
["번호","1차사업소","사업소","설비명","공사명","공사개요","신청일시",null,"조정일시",null,"작업구분","연간반영\n(Y/N)","처리결과\n(Y/N)","처리사유","Key-point","시송전설비\n여부"]
[{"$nulls":6},"시작","종료","시작","종료"]
[1,"서울","중부","중부S/S 345kV #1 BUS","15년 중부전력지사 장기사용 배전반 대체공사","중부S/S 345kV #1 모선보호반 대체공사","2015-08-24 10:00","2015-08-28 18:00","2015-08-24 10:00","2015-08-28 18:00","연속",null,null,null,201506150125,{"$f":"IF(ISERROR(VLOOKUP(D5,[1]시송전설비!$C$2:$O$130,13,0)),\"-\",VLOOKUP(D5,[1]시송전설비!$C$2:$O$130,13,0))","v":"-"}]
[2,"서울","중부","중부S/S 345kV #2 BUS","15년 중부전력지사 장기사용 배전반 대체공사","중부S/S 345kV #2 모선보호반 대체공사","2015-08-31 10:00","2015-09-04 18:00","2015-08-31 10:00","2015-09-04 18:00","연속",null,null,null,201506150126,{"$f":"IF(ISERROR(VLOOKUP(D6,[1]시송전설비!$C$2:$O$130,13,0)),\"-\",VLOOKUP(D6,[1]시송전설비!$C$2:$O$130,13,0))","v":"-"}]
[3,"인천","인천","신가좌인천CC#1 T/L","345kV가정루원시티 지중화 정비공사","345kV 가정루원시티 지중화 정비공사 -신설:3기[4회선(345kV 신가좌-인천CC No.18),2회선 C/H(154kV, 345kV)] -교체:1기[345kV 신가좌-인천CC No.19 Enclosing 공법으로 철탑교체] -철거:20기[345kV 5기, 154kV 15기]","2015-08-28 09:00","2015-09-06 18:00","2015-08-28 09:00","2015-09-06 18:00","연속",null,null,"신뢰도개선",201506170025,{"$f":"IF(ISERROR(VLOOKUP(D7,[1]시송전설비!$C$2:$O$130,13,0)),\"-\",VLOOKUP(D7,[1]시송전설비!$C$2:$O$130,13,0))","v":"-"}]
[4,"경기북부","파주","신덕은S/S #2 M.Tr A","2015년 파주전력 362kV GIS 정밀점검공사","7202DS 가스누기 보수","2015-08-27 09:00","2015-08-28 18:00","2015-08-27 09:00","2015-08-28 18:00","연속",null,null,null,201506150219,{"$f":"IF(ISERROR(VLOOKUP(D8,[1]시송전설비!$C$2:$O$130,13,0)),\"-\",VLOOKUP(D8,[1]시송전설비!$C$2:$O$130,13,0))","v":"-"}]
[5,"충북","직할","신제천S/S #1 M.Tr A","신제천S/S GIS화 공사","신제천S/S 옥외철구 GIS화 (345kV GIS 15CB, 154kV GIS 28CCT) ○ 신제천S/S 345kV FACTS 설비 설치공간 확보 ○ 옥외철구설비 GIS화를 통한 전력공급 신뢰도 제고 - 154kV T-BUS 철거 작업구간(154kV GIS 공사구간) 확보","2015-08-19 09:00","2015-08-19 18:00","취소","취소","연속",null,null,null,201506220111,{"$f":"IF(ISERROR(VLOOKUP(D9,[1]시송전설비!$C$2:$O$130,13,0)),\"-\",VLOOKUP(D9,[1]시송전설비!$C$2:$O$130,13,0))","v":"-"}]
[6,"충북","직할","신제천S/S #2 M.Tr A","신제천S/S GIS화 공사","신제천S/S 옥외철구 GIS화 (345kV GIS 15CB, 154kV GIS 28CCT) ○ 신제천S/S 345kV FACTS 설비 설치공간 확보 ○ 옥외철구설비 GIS화를 통한 전력공급 신뢰도 제고 - 154kV T-BUS 철거 작업구간(154kV GIS 공사구간) 확보 - 345kV GIS 설치공간 확보","2015-08-24 09:00","2016-05-20 18:00","취소","취소","연속",null,null,null,201506220110,{"$f":"IF(ISERROR(VLOOKUP(D10,[1]시송전설비!$C$2:$O$130,13,0)),\"-\",VLOOKUP(D10,[1]시송전설비!$C$2:$O$130,13,0))","v":"-"}]
[7,"충북","직할","신제천S/S #4 M.Tr A","신제천S/S GIS화 공사","신제천S/S 옥외철구 GIS화 (345kV GIS 15CB, 154kV GIS 28CCT) ○ 신제천S/S 345kV FACTS 설비 설치공간 확보 ○ 옥외철구설비 GIS화를 통한 전력공급 신뢰도 제고 - 154kV T-BUS 철거 작업구간(154kV GIS 공사구간) 확보","2015-08-21 09:00","2015-08-21 18:00","취소","취소","연속",null,null,null,201506220114,{"$f":"IF(ISERROR(VLOOKUP(D11,[1]시송전설비!$C$2:$O$130,13,0)),\"-\",VLOOKUP(D11,[1]시송전설비!$C$2:$O$130,13,0))","v":"-"}]
[8,"충북","직할","신제천S/S #3 M.Tr A","신제천S/S GIS화 공사","신제천S/S 옥외철구 GIS화 (345kV GIS 15CB, 154kV GIS 28CCT) ○ 신제천S/S 345kV FACTS 설비 설치공간 확보 ○ 옥외철구설비 GIS화를 통한 전력공급 신뢰도 제고 - 154kV T-BUS 철거 작업구간(154kV GIS 공사구간) 확보","2015-08-20 09:00","2015-08-20 18:00","취소","취소","연속",null,null,null,201506220113,{"$f":"IF(ISERROR(VLOOKUP(D12,[1]시송전설비!$C$2:$O$130,13,0)),\"-\",VLOOKUP(D12,[1]시송전설비!$C$2:$O$130,13,0))","v":"-"}]
[9,"충북","직할","신충주S/S 345kV #2 BUS","345kV 신충주S/S 362kV GIS 설치공사","- 362kV GIS 1CB 설치 - 기타 부대작업","2015-08-18 09:00","2015-09-04 18:00","2015-08-22 09:00","2015-09-08 18:00","연속",null,null,null,201506120080,{"$f":"IF(ISERROR(VLOOKUP(D13,[1]시송전설비!$C$2:$O$130,13,0)),\"-\",VLOOKUP(D13,[1]시송전설비!$C$2:$O$130,13,0))","v":"-"}]
[10,"충북","청주","청원S/S #4 M.Tr A","청원S/S 변압기 방호벽 도장공사","345kV #4M.Tr 방호벽 도장","2015-08-04 09:00","2015-08-04 18:00","2015-08-04 09:00","2015-08-04 18:00","당일",null,null,null,201506100121,{"$f":"IF(ISERROR(VLOOKUP(D14,[1]시송전설비!$C$2:$O$130,13,0)),\"-\",VLOOKUP(D14,[1]시송전설비!$C$2:$O$130,13,0))","v":"-"}]
[11,"충북","청주","청원S/S #2 M.Tr A","청원S/S 변압기 방호벽 도장공사","345kV #2M.Tr 방호벽 도장","2015-08-03 09:00","2015-08-03 18:00","2015-08-03 09:00","2015-08-03 18:00","당일",null,null,null,201506100120,{"$f":"IF(ISERROR(VLOOKUP(D15,[1]시송전설비!$C$2:$O$130,13,0)),\"-\",VLOOKUP(D15,[1]시송전설비!$C$2:$O$130,13,0))","v":"-"}]
[12,"충북","청주","청원S/S #1 M.Tr A","청원S/S 변압기 방호벽 도장공사 및 을지훈련 대상설비","345kV #1M.Tr 방호벽 도장 및 을지훈련 대상설비","2015-08-05 09:00","2015-08-19 18:00","취소","취소","연속",null,null,null,201506100118,{"$f":"IF(ISERROR(VLOOKUP(D16,[1]시송전설비!$C$2:$O$130,13,0)),\"-\",VLOOKUP(D16,[1]시송전설비!$C$2:$O$130,13,0))","v":"-"}]
[13,"대전충남","대전","신옥천S/S #1 M.Tr A","○ 신옥천S/S 장기사용 345kV #1M.Tr 교체공사","○ 신옥천S/S 장기사용 345kV #1M.Tr 교체공사 - 345kV #1M.TR 철거.설치(단상 x 3대). - 모선,기초.제어케이블 정비 - 무부하 시험 및 사용전 검사 등","2015-08-20 07:00","2015-09-24 18:00","2015-08-20 07:00","2015-09-24 18:00","연속",null,null,null,201506010037,{"$f":"IF(ISERROR(VLOOKUP(D17,[1]시송전설비!$C$2:$O$130,13,0)),\"-\",VLOOKUP(D17,[1]시송전설비!$C$2:$O$130,13,0))","v":"-"}]
[14,"대전충남","서산","신서산S/S 345kV #5 Sh.R","신서산변전소 345kV #5Sh.R 교체공사","O 신설리액터 설치 후 운정/정지 상태 소음측정","2015-08-27 09:00","2015-08-27 18:00","2015-08-27 09:00","2015-08-27 18:00","당일",null,null,null,201506160110,{"$f":"IF(ISERROR(VLOOKUP(D18,[1]시송전설비!$C$2:$O$130,13,0)),\"-\",VLOOKUP(D18,[1]시송전설비!$C$2:$O$130,13,0))","v":"-"}]
[15,"전북","군산","청양군산#2 T/L","345kV 청양군산#2 T/L","군산P/O 노후배전반 대체공사(74Bay B/F반) 1. 345kV #74Bay 차단실패보호배전반 대체","2015-08-10 09:00","2015-08-14 18:00","2015-08-10 09:00","2015-08-14 18:00","연속",null,null,null,201506110152,{"$f":"IF(ISERROR(VLOOKUP(D19,[1]시송전설비!$C$2:$O$130,13,0)),\"-\",VLOOKUP(D19,[1]시송전설비!$C$2:$O$130,13,0))","v":"-"}]
[16,"전북","군산","청양군산#1 T/L","345kV 청양-군산#1 T/L","군산P/O 노후배전반 대체공사(73Bay B/F반) 1. 345kV #73Bay 차단실패보호배전반 대체","2015-08-03 09:00","2015-08-07 18:00","2015-08-03 09:00","2015-08-07 18:00","연속",null,null,null,201506110151,{"$f":"IF(ISERROR(VLOOKUP(D20,[1]시송전설비!$C$2:$O$130,13,0)),\"-\",VLOOKUP(D20,[1]시송전설비!$C$2:$O$130,13,0))","v":"-"}]
[17,"전북","군산","군산S/S #2 M.Tr A","345kV 군산S/S #2 M.Tr A","군산P/O 노후배전반 대체공사(74Bay B/F반) 1. 345kV #74Bay 차단실패보호배전반 대체","2015-08-10 09:00","2015-08-14 18:00","2015-08-10 09:00","2015-08-14 18:00","연속",null,null,null,201506110153,{"$f":"IF(ISERROR(VLOOKUP(D21,[1]시송전설비!$C$2:$O$130,13,0)),\"-\",VLOOKUP(D21,[1]시송전설비!$C$2:$O$130,13,0))","v":"-"}]
[18,"전북","김제","신김제한빛NP#2 T/L","345kV 신김제-한빛NP#2 T/L","김제P/O 345kV 차단기 정밀점검 공사 차단기 정밀점검(7400) 및 송전선로 사선애자 청소","2015-08-31 09:00","2015-09-06 18:00","취소","취소","연속",null,null,null,201506100156,{"$f":"IF(ISERROR(VLOOKUP(D22,[1]시송전설비!$C$2:$O$130,13,0)),\"-\",VLOOKUP(D22,[1]시송전설비!$C$2:$O$130,13,0))","v":"-"}]
[19,"대구경북","영주","한울2NP-한울3NP #3T/L","한울 3발 362kV 용량부족 GIS 대체공사","362kV GIS 용량부족 GIS(40kA-&gt50kA)12CB 대체공사 전담운영체계공사","2015-08-25 09:00","2015-10-13 10:00","2015-08-25 09:00","2015-10-13 10:00","연속",null,null,null,201506100004,{"$f":"IF(ISERROR(VLOOKUP(D23,[1]시송전설비!$C$2:$O$130,13,0)),\"-\",VLOOKUP(D23,[1]시송전설비!$C$2:$O$130,13,0))","v":"-"}]
[20,"부산울산","동부산","신고리고리NP#2 T/L","765kV 신고리S/S #2M.Tr 이설공사","ㅇ 작업내용 : 86Bay B/F PNL 시험 및 시험가압선로, 사용전검사 수검 - ‘15.08.18 : 86Bay B/F PNL 시험 - ‘15.08.19 10:00~08.20 10:00 : 신설설비 시험가압 선로 - ‘15.08.20 10:00~08.21 18:00 : 사용전검사 수검","2015-08-18 09:00","2015-08-21 18:00","2015-08-18 09:00","2015-08-21 18:00","연속",null,null,null,201506050220,{"$f":"IF(ISERROR(VLOOKUP(D24,[1]시송전설비!$C$2:$O$130,13,0)),\"-\",VLOOKUP(D24,[1]시송전설비!$C$2:$O$130,13,0))","v":"-"}]
[21,"부산울산","서부산","신녹산S/S 신김해#2-TIE CB (7300)","신녹산S/S #3M.Tr증설공사","- 345kV M.Tr 증설관련 GIS 1CB(7372) 증설 - 345kV M.Tr 1Bank 설치","2015-08-03 09:00","2015-08-28 18:00","2015-08-06 09:00","2015-08-28 18:00","연속",null,null,null,201506150279,{"$f":"IF(ISERROR(VLOOKUP(D25,[1]시송전설비!$C$2:$O$130,13,0)),\"-\",VLOOKUP(D25,[1]시송전설비!$C$2:$O$130,13,0))","v":"-"}]
[22,"부산울산","서부산","신녹산S/S 345KV #2BUS","신녹산S/S #3M.Tr증설공사","- 345kV M.Tr 증설관련 GIS 1CB 증설 - 345kV M.Tr 1Bank 설치","2015-08-03 09:00","2015-08-07 18:00","2015-08-06 09:00","2015-08-12 18:00","연속",null,null,null,201506150278,{"$f":"IF(ISERROR(VLOOKUP(D26,[1]시송전설비!$C$2:$O$130,13,0)),\"-\",VLOOKUP(D26,[1]시송전설비!$C$2:$O$130,13,0))","v":"-"}]
[23,"부산울산","울산","동울산신울산#2 T/L","345kV 동울산-신울산T/L 지장철탑 이설공사","○ 구간 : 345kV 동울산-신울산 T/L 118～122호간(1.834Km) ○ 철탑교체 : 1기(120호 : Ba2-45) ○ 가선로 구성(2회선) : 1기(120호 가철탑 : Ba2-35)","2015-08-06 09:00","2015-08-08 18:00","2015-08-06 09:00","2015-08-08 18:00","연속",null,null,null,201506090065,{"$f":"IF(ISERROR(VLOOKUP(D27,[1]시송전설비!$C$2:$O$130,13,0)),\"-\",VLOOKUP(D27,[1]시송전설비!$C$2:$O$130,13,0))","v":"-"}]
[24,"부산울산","울산","동울산신울산#1 T/L","345kV 동울산-신울산T/L 지장철탑 이설공사","○ 구간 : 345kV 동울산-신울산 T/L 118～122호간(1.834Km) ○ 철탑교체 : 1기(120호 : Ba2-45) ○ 가선로 구성(2회선) : 1기(120호 가철탑 : Ba2-35)","2015-08-03 09:00","2015-08-05 18:00","2015-08-03 09:00","2015-08-05 18:00","연속",null,null,null,201506090064,{"$f":"IF(ISERROR(VLOOKUP(D28,[1]시송전설비!$C$2:$O$130,13,0)),\"-\",VLOOKUP(D28,[1]시송전설비!$C$2:$O$130,13,0))","v":"○"}]
[25,"경남","통영","신고성S/S #1 M.Tr A","신고성S/S #1 M.Tr 보호계전기 모듈교체","신고성S/S #1M.Tr GE제 87(T60) 계전기 DSP 모듈교체 - 유사고장관련","2015-08-09 09:30","2015-08-09 18:30","2015-08-09 09:30","2015-08-09 18:30","당일",null,null,null,201506090017,{"$f":"IF(ISERROR(VLOOKUP(D29,[1]시송전설비!$C$2:$O$130,13,0)),\"-\",VLOOKUP(D29,[1]시송전설비!$C$2:$O$130,13,0))","v":"-"}]
["추가1","전북",null,"신남원한빛NP#2T/L","폴리머지지애자설치, 전력선교체","폴리머지지애자설치, 전력선교체","2015-08-19 07:00","2015-08-28 18:00","2015-08-19 07:00","2015-08-28 18:00","연속",{"$nulls":4},"-"]
["추가2","충북","청주","청원S/S #3 M.Tr A","청원S/S 변압기 방호벽 도장공사","345kV #1M.Tr 방호벽 도장","2015-08-05 09:00","2015-08-05 18:00","2015-08-05 09:00","2015-08-05 18:00","연속"]

{"sheet":"154송부","index":2,"n_rows":40,"n_cols":16,"rows_kept":40,"cut":false,"hidden":false,"merged":[[2,14,3,14],[2,15,3,15],[2,6,2,7],[2,8,2,9],[2,10,3,10],[2,11,3,11],[2,12,3,12],[2,13,3,13],[2,5,3,5],[2,0,3,0],[2,1,3,1],[2,2,3,2],[2,3,3,3],[2,4,3,4]]}
["2015년도 8월 휴전계획서"]
["154kV"]
["번호","1차사업소","사업소","설비명","공사명","공사개요","신청일시",null,"조정일시",null,"작업구분","연간반영\n(Y/N)","처리결과\n(Y/N)","처리사유","Key-point","시송전설비\n여부"]
[{"$nulls":6},"시작","종료","시작","종료"]
[1,"서울","성동","성동S/S 154kV #66 BUS","2015년 성동P/O 170kV 정밀점검(성동SS 성동마장3TL)","2015년 성동P/O 170kV 정밀점검(성동SS 성동마장3TL)","2015-08-30 10:00","2015-08-31 10:00","2015-08-30 10:00","2015-08-31 10:00","연속",null,null,null,201506170043,{"$f":"IF(ISERROR(VLOOKUP(D5,[1]시송전설비!$C$2:$O$130,13,0)),\"-\",VLOOKUP(D5,[1]시송전설비!$C$2:$O$130,13,0))","v":"-"}]
[2,"서울","성동","성동S/S 154kV #61 BUS","2015년 성동P/O 170kV 정밀점검(성동SS 성동마장3TL)","2015년 성동P/O 170kV 정밀점검(성동SS 성동마장3TL)","2015-08-29 08:00","2015-08-30 10:00","2015-08-29 08:00","2015-08-30 10:00","연속",null,null,null,201506170042,{"$f":"IF(ISERROR(VLOOKUP(D6,[1]시송전설비!$C$2:$O$130,13,0)),\"-\",VLOOKUP(D6,[1]시송전설비!$C$2:$O$130,13,0))","v":"-"}]
[3,"서울","성동","양주쌍문#2 T/L","2015년 가공송전정비 협력회사 총액공사","장기사용애자 성능시험 관련 시료 채취","2015-08-26 13:00","2015-08-26 18:00","2015-08-26 13:00","2015-08-26 18:00","당일",null,null,null,201506150008,{"$f":"IF(ISERROR(VLOOKUP(D7,[1]시송전설비!$C$2:$O$130,13,0)),\"-\",VLOOKUP(D7,[1]시송전설비!$C$2:$O$130,13,0))","v":"-"}]
[4,"서울","성동","쌍문미아#2 T/L","미아S/S 170KV 장기사용 GIS 교체공사","170KV 장기사용 GIS 철거 및 신규 설치","2015-08-24 09:30","2015-09-24 17:00","취소","취소","연속",null,null,null,201506260030,{"$f":"IF(ISERROR(VLOOKUP(D8,[1]시송전설비!$C$2:$O$130,13,0)),\"-\",VLOOKUP(D8,[1]시송전설비!$C$2:$O$130,13,0))","v":"-"}]
[5,"서울","성동","휘경종암#1 T/L","휘경S/S 170kV 장기사용 GIS 대체공사","휘경S/S 170kV 장기사용 GIS 대체공사","2015-08-20 09:00","2015-09-30 18:00","2015-08-20 09:00","2015-09-30 18:00","연속",null,null,null,201506260001,{"$f":"IF(ISERROR(VLOOKUP(D9,[1]시송전설비!$C$2:$O$130,13,0)),\"-\",VLOOKUP(D9,[1]시송전설비!$C$2:$O$130,13,0))","v":"-"}]
[6,"인천","시흥","논현에너지 T/L","오봉S/S 170kV 미래엔인천에너지T/L GIS 보통점검","오봉S/S 170kV 미래엔인천에너지T/L GIS 보통점검","2015-08-06 09:30","2015-08-06 18:00","2015-08-06 09:30","2015-08-06 18:00","당일",null,null,null,201506180038,{"$f":"IF(ISERROR(VLOOKUP(D10,[1]시송전설비!$C$2:$O$130,13,0)),\"-\",VLOOKUP(D10,[1]시송전설비!$C$2:$O$130,13,0))","v":"-"}]
[7,"인천","인천","계양북인천 T/L","345kV가정루원시티 지중화 정비공사","345kV 가정루원시티 지중화 정비공사 -신설:3기[4회선(345kV 신가좌-인천CC No.18),2회선 C/H(154kV, 345kV)] -교체:1기[345kV 신가좌-인천CC No.19 Enclosing 공법으로 철탑교체] -철거:20기[345kV 5기, 154kV 15기] ※ 345kV 신가좌-인천CCT/L No.19 Enclosing 기초공사(마이크로 파일 시공) 시행시 안전한 작업을 위하여 하단선로인 154kV 북인천-계양T/L 사전휴전(8/8~8/27)작업 시행으로 345kV신가좌-인천CCT/L 휴전일수 단축","2015-08-08 09:00","2015-10-14 18:00","2015-08-08 09:00","2015-10-14 18:00","연속",null,null,"신뢰도개선",201506170016,{"$f":"IF(ISERROR(VLOOKUP(D11,[1]시송전설비!$C$2:$O$130,13,0)),\"-\",VLOOKUP(D11,[1]시송전설비!$C$2:$O$130,13,0))","v":"○"}]
[8,"인천","인천","신가좌인천#1 T/L","154kV 주안-관교 등 4개 T/L 접지선 교체공사","접속함 중 기준이 변경된 접지선 150㎟ → 240㎟ 교체","2015-08-31 09:00","2015-09-08 18:00","2015-08-31 09:00","2015-09-08 18:00","연속",null,null,"신뢰도개선",201506150266,{"$f":"IF(ISERROR(VLOOKUP(D12,[1]시송전설비!$C$2:$O$130,13,0)),\"-\",VLOOKUP(D12,[1]시송전설비!$C$2:$O$130,13,0))","v":"-"}]
[9,"인천","인천","주안관교#2 T/L","154kV 주안-관교 등 4개 T/L 접지선 교체공사","접속함 중 기준이 변경된 접지선 150㎟ → 240㎟ 교체","2015-08-17 09:00","2015-08-28 18:00","2015-08-17 09:00","2015-08-28 18:00","연속",null,null,"신뢰도개선",201506150265,{"$f":"IF(ISERROR(VLOOKUP(D13,[1]시송전설비!$C$2:$O$130,13,0)),\"-\",VLOOKUP(D13,[1]시송전설비!$C$2:$O$130,13,0))","v":"-"}]
[10,"인천","인천","주안관교#1 T/L","154kV 주안-관교 등 4개 T/L 접지선 교체공사","접속함 중 기준이 변경된 접지선 150㎟ → 240㎟ 교체","2015-08-03 09:00","2015-08-14 18:00","2015-08-03 09:00","2015-08-14 18:00","연속",null,null,"신뢰도개선",201506150264,{"$f":"IF(ISERROR(VLOOKUP(D14,[1]시송전설비!$C$2:$O$130,13,0)),\"-\",VLOOKUP(D14,[1]시송전설비!$C$2:$O$130,13,0))","v":"-"}]
[11,"강원","동해","동해정선 T/L","동해S/S 취약설비 GIS화 공사","- 154kV 동해-정선T/L 인출 PT 이설","2015-08-01 08:00","2015-08-01 18:00","취소","취소","당일",null,null,null,201506150022,{"$f":"IF(ISERROR(VLOOKUP(D15,[1]시송전설비!$C$2:$O$130,13,0)),\"-\",VLOOKUP(D15,[1]시송전설비!$C$2:$O$130,13,0))","v":"-"}]
[12,"강원","동해","동해이원#1 T/L","동해S/S 취약설비 GIS화 공사","- 154kV 동해-이원#1T/L 인출 PT 이설","2015-08-02 08:00","2015-08-02 18:00","취소","취소","당일",null,null,null,201506150024,{"$f":"IF(ISERROR(VLOOKUP(D16,[1]시송전설비!$C$2:$O$130,13,0)),\"-\",VLOOKUP(D16,[1]시송전설비!$C$2:$O$130,13,0))","v":"-"}]
[13,"강원","동해","동해이원#2 T/L","동해S/S 취약설비 GIS화 공사","- 154kV 동해-이원#2T/L 인출 PT 이설","2015-08-03 08:00","2015-08-03 18:00","취소","취소","당일",null,null,null,201506150025,{"$f":"IF(ISERROR(VLOOKUP(D17,[1]시송전설비!$C$2:$O$130,13,0)),\"-\",VLOOKUP(D17,[1]시송전설비!$C$2:$O$130,13,0))","v":"-"}]
[14,"강원","원주","남원주원주#1 T/L","2015년 가공송전선로 순시점검 위탁공사","154kV 남원주-원주#1T/L 정밀점검(31기)","2015-08-05 09:00","2015-08-07 18:00","2015-08-05 09:00","2015-08-07 18:00","매일",null,null,null,201506120086,{"$f":"IF(ISERROR(VLOOKUP(D18,[1]시송전설비!$C$2:$O$130,13,0)),\"-\",VLOOKUP(D18,[1]시송전설비!$C$2:$O$130,13,0))","v":"-"}]
[15,"강원","원주","남원주원주#2 T/L","2015년 가공송전선로 순시점검 위탁공사","154kV 남원주-원주#2T/L 정밀점검(31기)","2015-08-10 09:00","2015-08-12 18:00","2015-08-10 09:00","2015-08-12 18:00","매일",null,null,null,201506120087,{"$f":"IF(ISERROR(VLOOKUP(D19,[1]시송전설비!$C$2:$O$130,13,0)),\"-\",VLOOKUP(D19,[1]시송전설비!$C$2:$O$130,13,0))","v":"-"}]
[16,"강원","직할","북춘천화천HP T/L","현장기술개발과제 시제품 현장 설치 및 정비대상개소 정비","외물접촉 고장 방지용 전력선 식별용 유도전원형 Multi 전력선 표시등구 설치 및 정비대상개소 정비","2015-08-27 09:00","2015-08-28 18:00","2015-08-27 09:00","2015-08-28 18:00","매일",null,null,null,201506160143,{"$f":"IF(ISERROR(VLOOKUP(D20,[1]시송전설비!$C$2:$O$130,13,0)),\"-\",VLOOKUP(D20,[1]시송전설비!$C$2:$O$130,13,0))","v":"-"}]
[17,"충북","직할","북충주충주#1 T/L","북충주충주#1T/L GIS 불량 관련 제작사 현장 확인","북충주충주#1T/L GIS 불량 관련 제작사 현장 확인","2015-08-31 09:00","2015-08-31 18:00","2015-08-31 09:00","2015-08-31 18:00","당일",null,null,null,201506150094,{"$f":"IF(ISERROR(VLOOKUP(D21,[1]시송전설비!$C$2:$O$130,13,0)),\"-\",VLOOKUP(D21,[1]시송전설비!$C$2:$O$130,13,0))","v":"○"}]
[18,"충북","직할","신제천영월CC#1 T/L","신제천S/S GIS화 공사","신제천S/S 옥외철구 GIS화 (345kV GIS 15CB, 154kV GIS 28CCT) ○ 신제천S/S 345kV FACTS 설비 설치공간 확보 ○ 옥외철구설비 GIS화를 통한 전력공급 신뢰도 제고 - 154kV T-BUS 철거 작업구간(154kV GIS 공사구간) 확보","2015-08-25 09:00","2015-08-25 18:00","2015-08-25 09:00","2015-08-25 18:00","연속",null,null,null,201506220118,{"$f":"IF(ISERROR(VLOOKUP(D22,[1]시송전설비!$C$2:$O$130,13,0)),\"-\",VLOOKUP(D22,[1]시송전설비!$C$2:$O$130,13,0))","v":"-"}]
[19,"충북","직할","신제천영월CC#2 T/L","신제천S/S GIS화 공사","신제천S/S 옥외철구 GIS화 (345kV GIS 15CB, 154kV GIS 28CCT) ○ 신제천S/S 345kV FACTS 설비 설치공간 확보 ○ 옥외철구설비 GIS화를 통한 전력공급 신뢰도 제고 - 154kV T-BUS 철거 작업구간(154kV GIS 공사구간) 확보","2015-08-26 09:00","2015-08-26 18:00","2015-08-26 09:00","2015-08-26 18:00","연속",null,null,null,201506220119,{"$f":"IF(ISERROR(VLOOKUP(D23,[1]시송전설비!$C$2:$O$130,13,0)),\"-\",VLOOKUP(D23,[1]시송전설비!$C$2:$O$130,13,0))","v":"-"}]
[20,"전북","군산","이리백산#1 T/L","154kV 이리-백산#1 T/L","154kV 이리-전주 등 2개T/L 지장철탑이설공사 임시선로 구성을 위한 가철탑 2기 시공관련 항타기 안전이격거리 확보","2015-08-10 08:00","2015-08-17 18:00","2015-08-10 08:00","2015-08-17 18:00","연속",null,null,null,201505120240,{"$f":"IF(ISERROR(VLOOKUP(D24,[1]시송전설비!$C$2:$O$130,13,0)),\"-\",VLOOKUP(D24,[1]시송전설비!$C$2:$O$130,13,0))","v":"-"}]
[21,"전북","직할","동전주북전주#2 T/L","154kV 동전주-북전주#2T/L","북전주S/S 170kV 장기사용 GIS 대체공사 가. 170kV 동전주-북전주#2T/L* 1CCT 대체 나. 170kV BusTie * 1CCT대체 다. 170kV Bus PT * 1CCT대체 라. Base Channel 및 안전점검대 * 1식 대체 마. 제이케이블 대체공사","2015-08-31 08:00","2015-09-25 18:00","2015-08-31 08:00","2015-09-25 18:00","연속",null,null,null,201506170007,{"$f":"IF(ISERROR(VLOOKUP(D25,[1]시송전설비!$C$2:$O$130,13,0)),\"-\",VLOOKUP(D25,[1]시송전설비!$C$2:$O$130,13,0))","v":"-"}]
[22,"전북","직할","북전주S/S 154kV #1 BUS TIE CB","154kV 북전주S/S #1 BUS TIE CB","북전주S/S 170kV 장기사용 GIS 대체공사 가. 170kV 동전주-북전주#2T/L* 1CCT 대체 나. 170kV BusTie * 1CCT대체 다. 170kV Bus PT * 1CCT대체 라. Base Channel 및 안전점검대 * 1식 대체 마. 제이케이블 대체공사","2015-08-31 08:00","2015-09-25 18:00","2015-08-31 08:00","2015-09-25 18:00","연속",null,null,null,201506170013,{"$f":"IF(ISERROR(VLOOKUP(D26,[1]시송전설비!$C$2:$O$130,13,0)),\"-\",VLOOKUP(D26,[1]시송전설비!$C$2:$O$130,13,0))","v":"-"}]
[23,"대구경북","달성","논공유가#2 T/L","논공S/S170kV GIS화 공사","O 154kV 송전선로 절체(옥외철구설비 GIS로 대체) - 인출변경(보강용 빔설치, 지중EBA 연결) - 송전선로 보호반 이설 및 시험 - 인출 단로기 철거(옥외철구) - 170kV GIS 무부하 가압 - 기타 부대작업","2015-08-30 09:00","2015-08-31 18:00","2015-08-30 09:00","2015-08-31 18:00","연속",null,null,null,201506040109,{"$f":"IF(ISERROR(VLOOKUP(D27,[1]시송전설비!$C$2:$O$130,13,0)),\"-\",VLOOKUP(D27,[1]시송전설비!$C$2:$O$130,13,0))","v":"-"}]
[24,"대구경북","달성","대구염색 T/L","고객측 선로 점검","고객측 선로점검","2015-08-02 08:00","2015-08-02 17:00","2015-08-02 08:00","2015-08-02 17:00","당일",null,null,null,201506170059,{"$f":"IF(ISERROR(VLOOKUP(D28,[1]시송전설비!$C$2:$O$130,13,0)),\"-\",VLOOKUP(D28,[1]시송전설비!$C$2:$O$130,13,0))","v":"-"}]
[25,"부산울산","서부산","서부산부민#1 T/L","345kV 서부산-북부산T/L 등 8개T/L 이설공사","154kV XLPE 2000㎟ 케이블 0.177km 이설","2015-08-01 08:00","2015-08-20 18:00","2015-08-01 08:00","2015-08-20 18:00","연속",null,null,null,201506160197,{"$f":"IF(ISERROR(VLOOKUP(D29,[1]시송전설비!$C$2:$O$130,13,0)),\"-\",VLOOKUP(D29,[1]시송전설비!$C$2:$O$130,13,0))","v":"-"}]
[26,"부산울산","서부산","서부산부민#2 T/L","345kV 서부산-북부산T/L 등 8개T/L 이설공사","154kV XLPE 2000㎟ 케이블 0.177km 이설","2015-08-21 08:00","2015-09-10 18:00","2015-08-21 08:00","2015-09-10 18:00","연속",null,null,null,201506160198,{"$f":"IF(ISERROR(VLOOKUP(D30,[1]시송전설비!$C$2:$O$130,13,0)),\"-\",VLOOKUP(D30,[1]시송전설비!$C$2:$O$130,13,0))","v":"-"}]
[27,"부산울산","울산","효문방어진 T/L","방어진S/S 170kV GIS 대체공사","현대#2T/L T분기 선로구성 공급","2015-08-02 08:00","2015-08-02 12:00","2015-08-02 08:00","2015-08-02 12:00","당일",null,null,null,201506150242,{"$f":"IF(ISERROR(VLOOKUP(D31,[1]시송전설비!$C$2:$O$130,13,0)),\"-\",VLOOKUP(D31,[1]시송전설비!$C$2:$O$130,13,0))","v":"-"}]
[28,"부산울산","울산","방어진영남TP#1 T/L","방어진S/S 170kV GIS 대체공사","681,687,686 시험가압(48H) 및 682 시험가압(2H)","2015-08-13 15:00","2015-08-15 17:00","2015-08-13 15:00","2015-08-15 17:00","연속",null,null,null,201506150247,{"$f":"IF(ISERROR(VLOOKUP(D32,[1]시송전설비!$C$2:$O$130,13,0)),\"-\",VLOOKUP(D32,[1]시송전설비!$C$2:$O$130,13,0))","v":"-"}]
[29,"부산울산","울산","방어진영남TP#2 T/L","방어진S/S 170kV GIS 대체공사","682 시험가압(48H)","2015-08-08 08:00","2015-08-10 08:00","2015-08-08 08:00","2015-08-10 08:00","연속",null,null,null,201506150248,{"$f":"IF(ISERROR(VLOOKUP(D33,[1]시송전설비!$C$2:$O$130,13,0)),\"-\",VLOOKUP(D33,[1]시송전설비!$C$2:$O$130,13,0))","v":"-"}]
[30,"부산울산","울산","방어진영남TP#1 T/L","방어진S/S 170kV GIS 대체공사","681 임시모선 시험가압(48H)","2015-08-04 08:00","2015-08-06 08:00","2015-08-04 08:00","2015-08-06 08:00","연속",null,null,null,201506150246,{"$f":"IF(ISERROR(VLOOKUP(D34,[1]시송전설비!$C$2:$O$130,13,0)),\"-\",VLOOKUP(D34,[1]시송전설비!$C$2:$O$130,13,0))","v":"-"}]
[31,"부산울산","울산","효문방어진 T/L","방어진S/S 170kV GIS 대체공사","현대#2T/L T분기 선로구성 해제","2015-08-16 05:00","2015-08-16 08:00","2015-08-16 05:00","2015-08-16 08:00","당일",null,null,null,201506150244,{"$f":"IF(ISERROR(VLOOKUP(D35,[1]시송전설비!$C$2:$O$130,13,0)),\"-\",VLOOKUP(D35,[1]시송전설비!$C$2:$O$130,13,0))","v":"-"}]
[32,"부산울산","울산","신온산온산#1 T/L","154kV 당월S/S 건설공사","154kV 당월S/S 최초가압(시험가압48시간) - 시험가압 선로","2015-08-29 10:00","2015-08-31 10:00","2015-08-29 10:00","2015-08-31 10:00","연속",null,null,null,201506110136,{"$f":"IF(ISERROR(VLOOKUP(D36,[1]시송전설비!$C$2:$O$130,13,0)),\"-\",VLOOKUP(D36,[1]시송전설비!$C$2:$O$130,13,0))","v":"-"}]
[33,"경남","직할","창공완암#1 T/L","154kV 창공-완암#1T/L 정밀점검","154kV 창공-완암#1T/L 정밀점검(2015년 가공송전선로 순시점검 위탁공사)","2015-08-01 08:30","2015-08-01 18:00","2015-08-01 08:30","2015-08-01 18:00","당일",null,null,null,201506090109,{"$f":"IF(ISERROR(VLOOKUP(D37,[1]시송전설비!$C$2:$O$130,13,0)),\"-\",VLOOKUP(D37,[1]시송전설비!$C$2:$O$130,13,0))","v":"-"}]
[34,"경남","직할","창공완암#2 T/L","154kV 창공-완암#2T/L 정밀점검","154kV 창공-완암#2T/L 정밀점검(2015년 가공송전선로 순시점검 위탁공사)","2015-08-01 08:30","2015-08-01 13:00","2015-08-01 08:30","2015-08-01 13:00","당일",null,null,null,201506090110,{"$f":"IF(ISERROR(VLOOKUP(D38,[1]시송전설비!$C$2:$O$130,13,0)),\"-\",VLOOKUP(D38,[1]시송전설비!$C$2:$O$130,13,0))","v":"-"}]
[35,"경남","진주","사천개양#1 T/L","154kV 사천-개양T/L 8~10호 지장송전선로 이설공사","- 설치 1기(9호) - 철거 1기(9호)","2015-08-01 06:00","2015-08-02 19:00","2015-08-01 06:00","2015-08-02 19:00","연속",null,null,null,201506100001,{"$f":"IF(ISERROR(VLOOKUP(D39,[1]시송전설비!$C$2:$O$130,13,0)),\"-\",VLOOKUP(D39,[1]시송전설비!$C$2:$O$130,13,0))","v":"-"}]
[36,"경남","진주","사천개양#2 T/L","154kV 사천-개양T/L 8~10호 지장송전선로 이설공사","- 설치 1기(9호) - 철거 1기(9호)","2015-08-01 06:00","2015-08-03 19:00","2015-08-01 06:00","2015-08-02 19:00","연속",null,null,null,201506100002,{"$f":"IF(ISERROR(VLOOKUP(D40,[1]시송전설비!$C$2:$O$130,13,0)),\"-\",VLOOKUP(D40,[1]시송전설비!$C$2:$O$130,13,0))","v":"-"}]

{"sheet":"한수원","index":3,"n_rows":12,"n_cols":20,"rows_kept":12,"cut":false,"hidden":false,"merged":[[2,19,3,19],[2,13,3,13],[2,14,3,14],[2,15,3,15],[2,16,3,16],[2,17,3,17],[2,18,3,18],[0,0,0,6],[2,12,3,12],[2,0,3,0],[2,1,3,1],[2,2,3,2],[2,3,3,3],[2,4,3,4],[2,5,3,5],[2,6,2,7],[2,8,2,9],[2,10,3,10],[2,11,3,11]]}
["2015년 8월 월간휴전계획표(한수원)"]
["345kV"]
["번호","1차사업소","사업소","설비명","공사명","공사개요","신청일시",null,"조정일시",null,"작업\n구분","연간\n(Y/N)","처리결과\n(Y/N)","처리사유","Key-point","북상\n선로","수도권\n환상망","발전\n연계","사업소간","사업소내"]
[{"$nulls":6},"시작","종료","시작","종료"]
[1,"고리본부","2발전소","#3 기동변압기(#1)","고리 3호기 계획예방정비관련 기동변압기 #1 점검\n* 조작차단기 : PCB 7500, 7572","○ 기동변압기 #1 정비공사","2015-08-13T09:00:00","2015-08-21T18:00:00","2015-08-13T09:00:00","2015-08-21T18:00:00","연속","Y"]
[2,"고리본부","2발전소","#3 기동변압기(#2)","고리 3호기 계획예방정비관련 기동변압기 #2 점검\n* 조작차단기 : PCB 7D00, 7D72","○ 기동변압기 #2 정비공사","2015-08-22T09:00:00","2015-08-30T18:00:00","2015-08-22T09:00:00","2015-08-30T18:00:00","연속","Y"]
[3,"월성본부","2발전소","#4 주변압기","월성 4호기 13차 계획예방정비 관련 주변압기(MOT) 및 소내용변압기(UST) 점검\n* 조작차단기 : PCB 7700, 7772","○ 주/소내용변압기 일반점검\n○ 주/소내용변압기 보호계전기 정기시험\n   (차단기 연동시험 포함) ","2015-08-18 09:00","2015-08-29 19:00","2015-08-18 09:00","2015-08-29 19:00","연속","Y"]
[4,"월성본부","2발전소","#4 기동용변압기","월성 4호기 13차 계획예방정비 관련 기동용변압기(SST) 점검\n* 조작차단기 : PCB 7800, 7872","○ 기동용변압기 일반점검\n○ 기동용변압기 보호계전기 정기시험\n   (차단기 연동시험 포함) ","2015-08-30 23:00","2015-09-08 13:00","2015-08-30 23:00","2015-09-08 13:00","연속","Y"]
[5,"한빛본부","2발전소","#4 주변압기","4호기 15차 계획예방정비\n* 조작차단기 : PCB 7A00, 7A71","○ O/H 관련 #4 주변압기 점검\n○ 보호계전기 개체 및 연동시험","2015-08-06 10:00","2015-11-18 22:30","2015-08-06 10:00","2015-11-18 22:30","연속","Y"]
[6,"한빛본부","2발전소","#4 기동변압기(03XN)","4호기 15차 계획예방정비\n* 조작차단기 : PCB 7900, 7971","○ O/H 관련 #4 기동변압기(03XN) 점검\n○ 보호계전기 개체 및 연동시험","2015-08-16 13:00","2015-08-26 12:00","2015-08-16 13:00","2015-08-26 12:00","연속","Y"]
[7,"한빛본부","3발전소","#5 주변압기","주변압기 내부 정밀점검 공사\n* 조작차단기 : PCB 7D00, 7D71","○ 주변압기 일반점검","2015-08-12T09:00:00","2015-08-29T18:00:00","2015-08-12T09:00:00","2015-08-29T18:00:00","연속","Y"]
[8,"한빛본부","3발전소","#5 대기보조변압기","대기보조변압기 일반점검\n*조작차단기 : PCB 7B00","○ 대기보조변압기 SPR 3중화 개선작업\n○ 대기보조변압기 일반점검","2015-08-31T09:00:00","2015-09-10T18:00:00","2015-08-31T09:00:00","2015-09-10T18:00:00","연속","Y"]